{"text_format":"1","workbook":"xlsx","n_sheets":6,"sheets":["Číselník","Posuvník","Zátržítko","Přepínač","Seznam","Pole se seznamem"],"not_rendered":{"charts":0,"images":6,"macros":1,"external_links":0,"defined_names":0,"comments":0,"pivot_tables":0},"unopened":[],"bounds":{"document_bytes":16777216,"sheet_cells":100000,"rows_first":2000,"rows_last":500,"rows_between":2000,"halvings":0,"cell_chars":16384,"cell_head_chars":4096},"cells_cut":0,"cells_raw":0,"read":"whole","date_system":"1900"}

{"sheet":"Číselník","index":0,"n_rows":16,"n_cols":6,"rows_kept":16,"cut":false,"hidden":false,"merged":[]}
[]
[]
[]
[]
[]
[]
[]
[]
[]
[]
[]
[]
[]
[]
[null,null,null,null,null,"propojená buňka"]
[null,null,null,null,null,21]

{"sheet":"Posuvník","index":1,"n_rows":15,"n_cols":6,"rows_kept":15,"cut":false,"hidden":false,"merged":[]}
[]
[]
[]
[]
[]
[]
[]
[]
[]
[]
[]
[]
[]
[null,null,null,null,null,"propojená buňka"]
[null,null,null,null,null,2001]

{"sheet":"Zátržítko","index":2,"n_rows":21,"n_cols":7,"rows_kept":21,"cut":false,"hidden":false,"merged":[]}
[]
[]
[]
[]
[]
[]
[]
[]
[]
[null,null,null,null,null,"propojená \nbuňka","vyhodnocení"]
[]
[]
[null,null,null,null,null,true,{"$f":"IF(F13,\"zaškrtnuto A\",\"nezaškrtnuto A\")","v":"zaškrtnuto A"}]
[]
[]
[]
[null,null,null,null,null,true,{"$f":"IF(F17,\"zaškrtnuto B\",\"nezaškrtnuto B\")","v":"zaškrtnuto B"}]
[]
[]
[]
[null,null,null,null,null,false,{"$f":"IF(F21,\"zaškrtnuto C\",\"nezaškrtnuto C\")","v":"nezaškrtnuto C"}]

{"sheet":"Přepínač","index":3,"n_rows":25,"n_cols":7,"rows_kept":25,"cut":false,"hidden":false,"merged":[[20,5,20,6]]}
[]
[]
[]
[]
[]
[]
[]
[]
[]
[]
[]
[]
[]
[null,null,null,null,null,"propojená buňka","vyhodnocení"]
[null,null,null,null,null,1,{"$f":"VLOOKUP(F15,F22:G25,2)","v":"zaškrtnuto A"}]
[]
[]
[]
[]
[]
[null,null,null,null,null,"pomocná tabulka"]
[null,null,null,null,null,1,"zaškrtnuto A"]
[null,null,null,null,null,2,"zaškrtnuto B"]
[null,null,null,null,null,3,"zaškrtnuto C"]
[null,null,null,null,null,4,"zaškrtnuto D"]

{"sheet":"Seznam","index":4,"n_rows":24,"n_cols":7,"rows_kept":24,"cut":false,"hidden":false,"merged":[[19,5,19,6]]}
[]
[]
[]
[]
[]
[]
[]
[]
[]
[]
[]
[null,null,null,null,null,null,"seznam"]
[null,null,null,null,null,null,"varianta A"]
[null,null,null,null,"propojená buňka",null,"varianta B"]
[null,null,null,null,2,null,"varianta C"]
[null,null,null,null,null,null,"varianta D"]
[null,null,null,null,"vyhodnocení"]
[null,null,null,null,{"$f":"VLOOKUP(E15,F21:G24,2)","v":"vybráno B"}]
[]
[null,null,null,null,null,"pomocná tabulka"]
[null,null,null,null,null,1,"vybráno A"]
[null,null,null,null,null,2,"vybráno B"]
[null,null,null,null,null,3,"vybráno C"]
[null,null,null,null,null,4,"vybráno D"]

{"sheet":"Pole se seznamem","index":5,"n_rows":24,"n_cols":7,"rows_kept":24,"cut":false,"hidden":false,"merged":[[19,5,19,6]]}
[]
[]
[]
[]
[]
[]
[]
[]
[]
[]
[]
[null,null,null,null,null,null,"seznam"]
[null,null,null,null,null,null,"varianta A"]
[null,null,null,null,"propojená buňka",null,"varianta B"]
[null,null,null,null,2,null,"varianta C"]
[null,null,null,null,null,null,"varianta D"]
[null,null,null,null,"vyhodnocení"]
[null,null,null,null,{"$f":"VLOOKUP(E15,F21:G24,2)","v":"vybráno B"}]
[]
[null,null,null,null,null,"pomocná tabulka"]
[null,null,null,null,null,1,"vybráno A"]
[null,null,null,null,null,2,"vybráno B"]
[null,null,null,null,null,3,"vybráno C"]
[null,null,null,null,null,4,"vybráno D"]